sql_mysql.c:39:20: error: errmsg.h: そのようなファイルやディレクトリはありませんsql_mysql.c:40:19: error: mysql.h: そのようなファイルやディレクトリはありません
sql_mysql.c:47: error: syntax error before ‘MYSQL’
sql_mysql.c:47: 警告: struct や union の最後にセミコロンがありません
sql_mysql.c:48: 警告: type defaults to ‘int’ in declaration of ‘sock’
sql_mysql.c:48: 警告: データ定義が型や記憶クラスを持っていません
sql_mysql.c:49: error: syntax error before ‘*’ token
sql_mysql.c:49: 警告: type defaults to ‘int’ in declaration of ‘result’
sql_mysql.c:49: 警告: データ定義が型や記憶クラスを持っていません
sql_mysql.c:51: error: syntax error before ‘}’ token
sql_mysql.c:51: 警告: type defaults to ‘int’ in declaration of ‘rlm_sql_mysql_sock’
sql_mysql.c:51: 警告: データ定義が型や記憶クラスを持っていません
sql_mysql.c: In function ‘sql_init_socket’:
sql_mysql.c:62: error: ‘mysql_sock’ undeclared (first use in this function)
sql_mysql.c:62: error: (未宣言の各変数については、それが最初に現われたそれぞれの関数
sql_mysql.c:62: error: に対して一度だけ報告されます。)
sql_mysql.c:65: error: syntax error before ‘)’ token
sql_mysql.c:71: 警告: value computed is not used
sql_mysql.c:76: 警告: implicit declaration of function ‘mysql_init’
sql_mysql.c:76: 警告: nested extern declaration of ‘mysql_init’
sql_mysql.c:77: 警告: implicit declaration of function ‘mysql_real_connect’
sql_mysql.c:77: 警告: nested extern declaration of ‘mysql_real_connect’
sql_mysql.c:84: error: ‘CLIENT_FOUND_ROWS’ undeclared (first use in this function)
sql_mysql.c:86: 警告: implicit declaration of function ‘mysql_error’
sql_mysql.c:86: 警告: nested extern declaration of ‘mysql_error’
sql_mysql.c:86: 警告: format ‘%s’ expects type ‘char *’, but argument 3 has type ‘int’
sql_mysql.c: In function ‘sql_destroy_socket’:
sql_mysql.c:103: 警告: unused parameter ‘config’
sql_mysql.c: In function ‘sql_check_error’:
sql_mysql.c:122: error: ‘CR_SERVER_GONE_ERROR’ undeclared (first use in this function)
sql_mysql.c:123: error: ‘CR_SERVER_LOST’ undeclared (first use in this function)sql_mysql.c:131: error: ‘CR_OUT_OF_MEMORY’ undeclared (first use in this function)
sql_mysql.c:132: error: ‘CR_COMMANDS_OUT_OF_SYNC’ undeclared (first use in this function)
sql_mysql.c:133: error: ‘CR_UNKNOWN_ERROR’ undeclared (first use in this function)
sql_mysql.c: In function ‘sql_query’:
sql_mysql.c:151: error: ‘mysql_sock’ undeclared (first use in this function)
sql_mysql.c:160: 警告: implicit declaration of function ‘mysql_query’
sql_mysql.c:160: 警告: nested extern declaration of ‘mysql_query’
sql_mysql.c:161: 警告: implicit declaration of function ‘mysql_errno’
sql_mysql.c:161: 警告: nested extern declaration of ‘mysql_errno’
sql_mysql.c: In function ‘sql_store_result’:
sql_mysql.c:175: error: ‘mysql_sock’ undeclared (first use in this function)
sql_mysql.c:181: 警告: implicit declaration of function ‘mysql_store_result’
sql_mysql.c:181: 警告: nested extern declaration of ‘mysql_store_result’
sql_mysql.c:184: 警告: format ‘%s’ expects type ‘char *’, but argument 3 has type ‘int’
sql_mysql.c:173: 警告: unused parameter ‘config’
sql_mysql.c: In function ‘sql_num_fields’:
sql_mysql.c:202: error: ‘mysql_sock’ undeclared (first use in this function)
sql_mysql.c:204:5: warning: "MYSQL_VERSION_ID" is not defined
sql_mysql.c:207: 警告: implicit declaration of function ‘mysql_num_fields’
sql_mysql.c:207: 警告: nested extern declaration of ‘mysql_num_fields’
sql_mysql.c:211: 警告: format ‘%s’ expects type ‘char *’, but argument 3 has type ‘int’
sql_mysql.c:199: 警告: unused parameter ‘config’
sql_mysql.c: In function ‘sql_num_rows’:
sql_mysql.c:257: error: ‘mysql_sock’ undeclared (first use in this function)
sql_mysql.c:260: 警告: implicit declaration of function ‘mysql_num_rows’
sql_mysql.c:260: 警告: nested extern declaration of ‘mysql_num_rows’
sql_mysql.c:255: 警告: unused parameter ‘config’
sql_mysql.c: In function ‘sql_fetch_row’:
sql_mysql.c:277: error: ‘mysql_sock’ undeclared (first use in this function)
sql_mysql.c:286: 警告: implicit declaration of function ‘mysql_fetch_row’
sql_mysql.c:286: 警告: nested extern declaration of ‘mysql_fetch_row’
sql_mysql.c:286: 警告: assignment makes pointer from integer without a cast
sql_mysql.c:275: 警告: unused parameter ‘config’
sql_mysql.c: In function ‘sql_free_result’:
sql_mysql.c:305: error: ‘mysql_sock’ undeclared (first use in this function)
sql_mysql.c:308: 警告: implicit declaration of function ‘mysql_free_result’
sql_mysql.c:308: 警告: nested extern declaration of ‘mysql_free_result’
sql_mysql.c:303: 警告: unused parameter ‘config’
sql_mysql.c: In function ‘sql_error’:
sql_mysql.c:327: error: ‘mysql_sock’ undeclared (first use in this function)
sql_mysql.c:330: 警告: return discards qualifiers from pointer target type
sql_mysql.c:332: 警告: return makes pointer from integer without a cast
sql_mysql.c:325: 警告: unused parameter ‘config’
sql_mysql.c: In function ‘sql_close’:
sql_mysql.c:346: error: ‘mysql_sock’ undeclared (first use in this function)
sql_mysql.c:349: 警告: implicit declaration of function ‘mysql_close’
sql_mysql.c:349: 警告: nested extern declaration of ‘mysql_close’
sql_mysql.c:344: 警告: unused parameter ‘config’
sql_mysql.c: In function ‘sql_finish_query’:
sql_mysql.c:364: 警告: unused parameter ‘sqlsocket’
sql_mysql.c:364: 警告: unused parameter ‘config’
sql_mysql.c: In function ‘sql_affected_rows’:
sql_mysql.c:395: error: ‘mysql_sock’ undeclared (first use in this function)
sql_mysql.c:397: 警告: implicit declaration of function ‘mysql_affected_rows’
sql_mysql.c:397: 警告: nested extern declaration of ‘mysql_affected_rows’
sql_mysql.c:393: 警告: unused parameter ‘config’
gmake[10]: *** [sql_mysql.o] エラー 1
gmake[10]: Leaving directory `/root/freeradius-1.0.5/src/modules/rlm_sql/drivers/rlm_sql_mysql'
gmake[9]: *** [common] エラー 2
gmake[9]: Leaving directory `/root/freeradius-1.0.5/src/modules/rlm_sql/drivers'gmake[8]: *** [static] エラー 2
gmake[8]: Leaving directory `/root/freeradius-1.0.5/src/modules/rlm_sql/drivers'gmake[7]: *** [common] エラー 2
gmake[7]: Leaving directory `/root/freeradius-1.0.5/src/modules/rlm_sql'
gmake[6]: *** [static] エラー 2
gmake[6]: Leaving directory `/root/freeradius-1.0.5/src/modules/rlm_sql'
gmake[5]: *** [common] エラー 2
gmake[5]: Leaving directory `/root/freeradius-1.0.5/src/modules'
gmake[4]: *** [all] エラー 2
gmake[4]: Leaving directory `/root/freeradius-1.0.5/src/modules'
gmake[3]: *** [common] エラー 2
gmake[3]: Leaving directory `/root/freeradius-1.0.5/src'
gmake[2]: *** [all] エラー 2
gmake[2]: Leaving directory `/root/freeradius-1.0.5/src'
gmake[1]: *** [common] エラー 2
gmake[1]: Leaving directory `/root/freeradius-1.0.5'
make: *** [all] エラー 2